{"text_format":"1","workbook":"xlsx","n_sheets":9,"sheets":["Introductie","AANPAK","Reflectie methodiek 2206","ZELF.TEAM","Reflectie Zelf_Team 1506","Input Scores","SCORES","Informatie","Wijzigingen"],"not_rendered":{"charts":0,"images":73,"macros":1,"external_links":0,"defined_names":3,"comments":6,"pivot_tables":0},"unopened":[],"bounds":{"document_bytes":16777216,"sheet_cells":100000,"rows_first":2000,"rows_last":500,"rows_between":2000,"halvings":0,"cell_chars":16384,"cell_head_chars":4096},"cells_cut":0,"cells_raw":0,"read":"whole","date_system":"1900"}

{"sheet":"Introductie","index":0,"n_rows":52,"n_cols":5,"rows_kept":52,"cut":false,"hidden":false,"merged":[[49,3,49,4],[45,3,45,4],[40,3,40,4],[33,3,33,4],[11,3,11,4],[7,3,7,4],[9,3,9,4],[19,3,19,4],[17,3,17,4],[27,3,27,4],[21,3,21,4]]}
[]
[]
[]
[]
[]
[]
[]
[null,null,null,"De jeugdgezondheidszorg (JGZ) heeft een belangrijke poortwachtersrol. JGZ-professionals signaleren risico’s en problemen van de jeugd en bieden of organiseren ondersteuning waar nodig. Als het gaat om de mentale gezondheid van jongeren, wat zou je als professional dan idealiter meten en moeten weten? Hoe wordt de JGZ optimaal gepositioneerd en wat is een goede vorm voor contact? Welke vakmanschap versterkende tools kunnen hierin ondersteunend zijn?\n"]
[]
[null,null,null,"Deze reflectietool ‘Jongeren in de JGZ’ heeft als doel om JGZ-professionals te inspireren en te stimuleren tot reflecteren op de JGZ-uitvoeringspraktijk in de adolescentiefase. De tool maakt wetenschappelijke kennis en inzichten over kwetsbaarheid in de adolescentie, praktisch toepasbaar in de JGZ-praktijk. "]
[]
[null,null,null,"Je wordt als JGZ-professional of manager in de tool uitgedaagd tot een systematische reflectie op de gebruikte aanpak binnen de organisatie en het eigen handelen (van jouzelf en/of jouw team): "]
[]
[null,null,null,"1.","Reflectie op aanpak: In hoeverre komen de verschillende aspecten die relevant zijn met betrekking tot ongelijkheid en kwetsbaarheid van jongeren, voldoende aan bod in de aanpak voor jongeren die in jouw JGZ-organisatie gebruikt wordt? "]
[]
[null,null,null,"2.","Reflectie op zelf/team: In hoeverre worden deze verschillende aspecten in de praktijk uitgevoerd door jouzelf en/of jouw team? "]
[]
[null,null,null,"Een dergelijke systematische reflectie op de eigen werkwijze(n) maakt inzichtelijk waar in de uitvoeringspraktijk tijdens de adolescentie verbetering of doorontwikkeling mogelijk is. "]
[]
[null,null,null,"De tool is ontwikkeld als onderdeel van het Health Equality Youth (HEY)-project (2018-2021).  Het HEY project is een deelstudie van het startimpulsproject ‘Gelijke kansen voor een diverse jeugd’ dat uitgevoerd werd als onderdeel van de route ‘Jeugd in ontwikkeling, opvoeding en onderwijs’ van de Nationale Wetenschapsagenda."]
{"$rows_left_out":33}
{"sheet":"AANPAK","index":1,"n_rows":101,"n_cols":10,"rows_kept":101,"cut":false,"hidden":false,"merged":[[74,9,74,10],[75,9,75,10],[76,9,76,10],[77,9,77,10],[79,9,79,10],[66,9,66,10],[67,9,67,10],[68,9,68,10],[69,9,69,10],[73,9,73,10],[97,9,97,10],[98,9,98,10],[100,9,100,10],[92,9,92,10],[93,9,93,10],[94,9,94,10],[95,9,95,10],[96,9,96,10],[83,9,83,10],[84,9,84,10],[85,9,85,10],[86,9,86,10],[88,9,88,10],[58,9,58,10],[59,9,59,10],[60,9,60,10],[61,9,61,10],[65,9,65,10],[49,9,49,10],[50,9,50,10],[51,9,51,10],[53,9,53,10],[57,9,57,10],[38,9,38,10],[42,9,42,10],[43,9,43,10],[44,9,44,10],[45,9,45,10],[30,9,30,10],[34,9,34,10],[35,9,35,10],[36,9,36,10],[37,9,37,10],[25,9,25,10],[26,9,26,10],[27,9,27,10],[28,9,28,10],[29,9,29,10],[17,9,17,10],[18,9,18,10],[19,9,19,10],[23,9,23,10],[24,9,24,10],[97,3,97,7],[74,3,74,7],[75,3,75,7],[76,3,76,7],[83,3,83,7],[84,3,84,7],[85,3,85,7],[92,3,92,7],[93,3,93,7],[94,3,94,7],[95,3,95,7],[96,3,96,7],[73,3,73,7],[44,3,44,7],[49,3,49,7],[50,3,50,7],[57,3,57,7],[58,3,58,7],[59,3,59,7],[60,3,60,7],[65,3,65,7],[66,3,66,7],[67,3,67,7],[68,3,68,7],[43,3,43,7],[24,3,24,7],[25,3,25,7],[26,3,26,7],[27,3,27,7],[28,3,28,7],[29,3,29,7],[34,3,34,7],[35,3,35,7],[36,3,36,7],[37,3,37,7],[42,3,42,7],[23,3,23,7],[6,7,6,9],[7,7,7,9],[8,7,8,9],[9,7,9,9],[10,7,10,9],[14,3,14,7],[15,3,15,7],[16,3,16,7],[17,3,17,7],[18,3,18,7],[14,9,14,10],[15,9,15,10],[16,9,16,10]]}
[]
[]
[]
[]
[]
[null,null,null,null,null,null,"SCHAAL 1-5 "]
[null,null,null,null,null,null,"score 1","Dit aspect is geen onderdeel van de werkwijze. Het aspect komt in het geheel niet aan bod in de beschrijving van de aanpak."]
[null,null,null,null,null,null,"score 2","Dit aspect kan onderdeel zijn van de werkwijze, maar nergens wordt expliciet beschreven hoe dit thema of aspect aan bod kan komen."]
[null,null,null,null,null,null,"score 3","Dit aspect kan onderdeel zijn van de werkwijze. Er wordt globaal beschreven hoe dit thema of aspect aan bod komt."]
[null,null,null,null,null,null,"score 4","Dit aspect is onderdeel van de werkwijze. Er wordt globaal beschreven hoe dit thema of aspect aan bod komt."]
[null,null,null,null,null,null,"score 5","Dit aspect is duidelijk onderdeel van de werkwijze en er wordt concreet beschreven hoe dit aspect nagevraagd moet worden."]
[]
[null,null,"ONVEILIGE OMGEVING",null,null,null,null,null,null,"SCORE 1-5"]
[null,null,{"$f":"'Reflectie methodiek 2206'!B3","v":"In hoeverre wordt in deze aanpak gevraagd… "}]
[null,null,1,{"$f":"VLOOKUP(C15,'Reflectie methodiek 2206'!A:B,2,0)","v":"naar ingrijpende gebeurtenissen voor een jongere, zoals ernstige ziekte, verlies van dierbaren, of (echt)scheiding?"},null,null,null,null,null,1]
[null,null,2,{"$f":"VLOOKUP(C16,'Reflectie methodiek 2206'!A:B,2,0)","v":"naar de mate van stress die de jongere ervaart?"},null,null,null,null,null,1]
[null,null,3,{"$f":"VLOOKUP(C17,'Reflectie methodiek 2206'!A:B,2,0)","v":"of de jongere zich onveilig voelt bij vrienden/leeftijdsgenoten, bijvoorbeeld door buitensluiten en/of pesten?"},null,null,null,null,null,1]
[null,null,4,{"$f":"VLOOKUP(C18,'Reflectie methodiek 2206'!A:B,2,0)","v":"of de jongere zich onveilig voelt op school door buitensluiten en/of pesten?"},null,null,null,null,null,1]
[null,null,5,{"$f":"VLOOKUP(C19,'Reflectie methodiek 2206'!A:B,2,0)","v":"of de jongere zich onveilig voelt in de thuissituatie/gezin ? (denk aan mishandeling, verwaarlozing, of geweld tussen ouders) "},null,null,null,null,null,1]
[null,null,"TOTAALSCORE",null,null,null,null,null,null,{"$f":"IFERROR(AVERAGE(J15:J19),0)","v":1}]
{"$rows_left_out":82}
{"sheet":"Reflectie methodiek 2206","index":2,"n_rows":77,"n_cols":8,"rows_kept":77,"cut":false,"hidden":true,"merged":[]}
["Reflectie op aanpak"]
[]
["Onveilige omgeving                ","In hoeverre wordt in deze aanpak gevraagd… ",null,"SCORE 1-5"]
[1,"naar ingrijpende gebeurtenissen voor een jongere, zoals ernstige ziekte, verlies van dierbaren, of (echt)scheiding?",null,2,null,"niet ok",null,"=VLOOKUP(C15;'Reflectie methodiek 1506'!A:B;2;0)"]
[2,"naar de mate van stress die de jongere ervaart?",null,1,null,"niet ok"]
[3,"of de jongere zich onveilig voelt bij vrienden/leeftijdsgenoten, bijvoorbeeld door buitensluiten en/of pesten?",null,2,null,"niet ok"]
[4,"of de jongere zich onveilig voelt op school door buitensluiten en/of pesten?",null,3,null,""]
[5,"of de jongere zich onveilig voelt in de thuissituatie/gezin ? (denk aan mishandeling, verwaarlozing, of geweld tussen ouders) ",null,1,null,"niet ok"]
[null,"Totaalscore","Onveilige  Omgeving ",{"$f":"AVERAGE(D4:D8)","v":1.8},null,""]
[null,null,null,null,null,""]
["Leefstijl                           I","In hoeverre wordt in deze aanpak…",null,null,null,""]
[6,"het gewicht van de jongere gemeten/uitgevraagd?",null,4,null,""]
[7,"het gewicht met de jongere besproken?",null,4,null,""]
[8,"nagevraagd of de jongere regelmatig ontbijt?  ",null,3,null,""]
[9,"nagevraagd of de jongere lichaamsbeweging heeft en in welke mate? ",null,2,null,""]
[10,"navraag gedaan naar alcoholgebruik? ",null,5,null,""]
[11,"navraag gedaan naar drugsgebruik?",null,1,null,""]
[12,"navraag gedaan naar gameverslaving?",null,1,null,""]
[null,"Totaalscore","Leefstijl ",{"$f":"AVERAGE(D12:D18)","v":2.8571428571428572},null,""]
[null,null,null,null,null,""]
{"$rows_left_out":58}
{"sheet":"ZELF.TEAM","index":3,"n_rows":101,"n_cols":10,"rows_kept":101,"cut":false,"hidden":false,"merged":[[97,9,97,10],[98,9,98,10],[100,9,100,10],[92,9,92,10],[93,9,93,10],[94,9,94,10],[95,9,95,10],[96,9,96,10],[83,9,83,10],[84,9,84,10],[85,9,85,10],[86,9,86,10],[88,9,88,10],[74,9,74,10],[75,9,75,10],[76,9,76,10],[77,9,77,10],[79,9,79,10],[66,9,66,10],[67,9,67,10],[68,9,68,10],[69,9,69,10],[73,9,73,10],[58,9,58,10],[59,9,59,10],[60,9,60,10],[61,9,61,10],[65,9,65,10],[49,9,49,10],[50,9,50,10],[51,9,51,10],[53,9,53,10],[57,9,57,10],[38,9,38,10],[42,9,42,10],[43,9,43,10],[44,9,44,10],[45,9,45,10],[30,9,30,10],[34,9,34,10],[35,9,35,10],[36,9,36,10],[37,9,37,10],[25,9,25,10],[26,9,26,10],[27,9,27,10],[28,9,28,10],[29,9,29,10],[17,9,17,10],[18,9,18,10],[19,9,19,10],[23,9,23,10],[24,9,24,10],[97,3,97,7],[74,3,74,7],[75,3,75,7],[76,3,76,7],[83,3,83,7],[84,3,84,7],[85,3,85,7],[92,3,92,7],[93,3,93,7],[94,3,94,7],[95,3,95,7],[96,3,96,7],[73,3,73,7],[44,3,44,7],[49,3,49,7],[50,3,50,7],[57,3,57,7],[58,3,58,7],[59,3,59,7],[60,3,60,7],[65,3,65,7],[66,3,66,7],[67,3,67,7],[68,3,68,7],[43,3,43,7],[24,3,24,7],[25,3,25,7],[26,3,26,7],[27,3,27,7],[28,3,28,7],[29,3,29,7],[34,3,34,7],[35,3,35,7],[36,3,36,7],[37,3,37,7],[42,3,42,7],[23,3,23,7],[6,7,6,9],[7,7,7,9],[8,7,8,9],[9,7,9,9],[10,7,10,9],[14,3,14,7],[15,3,15,7],[16,3,16,7],[17,3,17,7],[18,3,18,7],[14,9,14,10],[15,9,15,10],[16,9,16,10]]}
[]
[]
[]
[]
[]
[null,null,null,null,null,null,"SCHAAL 1-5 "]
[null,null,null,null,null,null,"score 1","Dit aspect is in het geheel niet van toepassing op mij en mijn teamgenoten."]
[null,null,null,null,null,null,"score 2","Dit aspect is zelden tot nooit van toepassing op mij en mijn teamgenoten."]
[null,null,null,null,null,null,"score 3","Dit aspect is soms wel, en soms niet van toepassing op mij en mijn teamgenoten."]
[null,null,null,null,null,null,"score 4","Dit aspect is meestal wel van toepassing op mij en mijn teamgenoten. "]
[null,null,null,null,null,null,"score 5","Dit aspect is altijd van toepassing op mij en mijn teamgenoten.  "]
[]
[null,null,"ONVEILIGE OMGEVING",null,null,null,null,null,null,"SCORE 1-5"]
[null,null,{"$f":"INDEX('Reflectie Zelf_Team 1506'!A:B,MATCH(C13,'Reflectie Zelf_Team 1506'!A:A,0),2)","v":"In hoeverre zijn onderstaande uitspraken op jou/jouw team van toepassing? "}]
[null,null,1,{"$f":"VLOOKUP(C15,'Reflectie Zelf_Team 1506'!A:B,2,0)","v":"Ik/mijn team vraag(t) naar ingrijpende gebeurtenissen voor een jongere, zoals ernstige ziekte, verlies van dierbaren, of (echt)scheiding"},null,null,null,null,null,2]
[null,null,2,{"$f":"VLOOKUP(C16,'Reflectie Zelf_Team 1506'!A:B,2,0)","v":"Ik/mijn team vraag(t) naar de mate van stress die de jongere ervaart"},null,null,null,null,null,2]
[null,null,3,{"$f":"VLOOKUP(C17,'Reflectie Zelf_Team 1506'!A:B,2,0)","v":"Ik/mijn team vraag(t) of de jongere zich onveilig voelt bij vrienden/leeftijdsgenoten bijvoorbeeld door buitensluiten en/of pesten "},null,null,null,null,null,2]
[null,null,4,{"$f":"VLOOKUP(C18,'Reflectie Zelf_Team 1506'!A:B,2,0)","v":"Ik/mijn team vraag(t) of de jongere zich onveilig voelt op school door buitensluiten en/of pesten"},null,null,null,null,null,2]
[null,null,5,{"$f":"VLOOKUP(C19,'Reflectie Zelf_Team 1506'!A:B,2,0)","v":"Ik/mijn team vraag(t) of de jongere zich onveilig voelt in de thuissituatie /gezin? (denk aan mishandeling, verwaarlozing, of geweld tussen ouders)  "},null,null,null,null,null,2]
[null,null,"TOTAALSCORE",null,null,null,null,null,null,{"$f":"IFERROR(AVERAGE(J15:J19),0)","v":2}]
{"$rows_left_out":82}
{"sheet":"Reflectie Zelf_Team 1506","index":4,"n_rows":77,"n_cols":6,"rows_kept":77,"cut":false,"hidden":true,"merged":[]}
["Reflectie op zelf/team"]
[]
["ONVEILIGE OMGEVING","In hoeverre zijn onderstaande uitspraken op jou/jouw team van toepassing? ",null,"SCORE 1-5",null,""]
[1,"Ik/mijn team vraag(t) naar ingrijpende gebeurtenissen voor een jongere, zoals ernstige ziekte, verlies van dierbaren, of (echt)scheiding",null,1,null,"niet ok"]
[2,"Ik/mijn team vraag(t) naar de mate van stress die de jongere ervaart",null,3,null,"niet ok"]
[3,"Ik/mijn team vraag(t) of de jongere zich onveilig voelt bij vrienden/leeftijdsgenoten bijvoorbeeld door buitensluiten en/of pesten ",null,5,null,""]
[4,"Ik/mijn team vraag(t) of de jongere zich onveilig voelt op school door buitensluiten en/of pesten",null,2,null,""]
[5,"Ik/mijn team vraag(t) of de jongere zich onveilig voelt in de thuissituatie /gezin? (denk aan mishandeling, verwaarlozing, of geweld tussen ouders)  ",null,2,null,""]
[null,"Totaalscore","Onveilige  Omgeving ",{"$f":"AVERAGE(D4:D8)","v":2.6},null,""]
[null,null,null,null,null,""]
["LEEFSTIJL","In hoeverre zijn onderstaande uitspraken op jou en jouw teamgenoten van toepassing?  ",null,null,null,""]
[6,"Ik/mijn team meet het gewicht van de jongere/vraag(t) dit uit",null,1,null,""]
[7,"Ik/mijn team bespreek(t) het gewicht met de jongere ",null,1,null,""]
[8,"Ik/mijn team vraag(t) aan de jongere of hij/zij regelmatig ontbijt",null,2,null,""]
[9,"Ik/mijn team vraag(t) aan de jongere of hij/zij lichaamsbeweging heeft en in welke mate",null,2,null,""]
[10,"Ik/mijn team vraag(t) aan de jongere of hij/zij alcohol gebruikt",null,1,null,""]
[11,"Ik/mijn team vraag(t) aan de jongere of hij/zij drugs gebruikt",null,1,null,""]
[12,"Ik/mijn team vraag(t) aan de jongere of hij/zij een gameverslaving heeft, of zeer veel gamet",null,3,null,""]
[null,"Totaalscore","Onveilige  Omgeving ",{"$f":"AVERAGE(D12:D18)","v":1.5714285714285714},null,""]
[null,null,null,null,null,""]
{"$rows_left_out":58}
{"sheet":"Input Scores","index":5,"n_rows":21,"n_cols":17,"rows_kept":21,"cut":false,"hidden":true,"merged":[]}
[]
[null,null,null,null,null,null,null,null,null,null,null,null,null,"PICTOS"]
[]
[null,null,{"$f":"UPPER(tlOnderdeel[[#Headers],[Onderdeel]])","v":"ONDERDEEL"},null,null,null,"AANPAK","ZELF / TEAM"]
[null,"Rij#","iconname","x","y","Onderdeel","Aantal vragen","Aantal witrijen","Rij Totaal Score","AANPAK","ZELF.TEAM","IDScore"]
[null,13,{"$f":"tlOnderdeel[[#This Row],[Onderdeel]]","v":"ONVEILIGE OMGEVING"},31,-28,{"$f":"INDIRECT(\"'\" &$J$5 & \"'!C\" &B6)","v":"ONVEILIGE OMGEVING"},5,2,{"$f":"B6+G6+tlOnderdeel[[#This Row],[Aantal witrijen]]","v":20},{"$f":"INDIRECT(\"'\" &J$5 & \"'!J\" &$I6)","v":1},{"$f":"INDIRECT(\"'\" &K$5 & \"'!J\" &$I6)","v":2},1]
[null,22,{"$f":"tlOnderdeel[[#This Row],[Onderdeel]]","v":"LEEFSTIJL"},47,-22,{"$f":"INDIRECT(\"'\" &$J$5 & \"'!C\" &B7)","v":"LEEFSTIJL"},7,2,{"$f":"B7+G7+tlOnderdeel[[#This Row],[Aantal witrijen]]","v":31},1,2,2]
[null,33,{"$f":"tlOnderdeel[[#This Row],[Onderdeel]]","v":"INTERNALISEREN - EXTERNALISEREN"},68,-11,"INTERNALISEREN - EXTERNALISEREN",4,2,{"$f":"B8+G8+tlOnderdeel[[#This Row],[Aantal witrijen]]","v":39},1,2,3]
[null,41,{"$f":"tlOnderdeel[[#This Row],[Onderdeel]]","v":"SCHOOLUITVAL"},67,9,"SCHOOLUITVAL",3,2,{"$f":"B9+G9+tlOnderdeel[[#This Row],[Aantal witrijen]]","v":46},1,2,4]
[null,48,{"$f":"tlOnderdeel[[#This Row],[Onderdeel]]","v":"SOCIALE OMGEVING"},47,22,"SOCIALE OMGEVING",2,2,{"$f":"B10+G10+tlOnderdeel[[#This Row],[Aantal witrijen]]","v":52},1,2,5]
[null,56,{"$f":"tlOnderdeel[[#This Row],[Onderdeel]]","v":"VORM CONTACT"},-36,38,"VORM CONTACT",4,2,{"$f":"B11+G11+tlOnderdeel[[#This Row],[Aantal witrijen]]","v":62},1,2,6]
[null,64,{"$f":"tlOnderdeel[[#This Row],[Onderdeel]]","v":"HOUDING PROFESSIONAL"},-56,22,"HOUDING PROFESSIONAL",4,2,{"$f":"B12+G12+tlOnderdeel[[#This Row],[Aantal witrijen]]","v":70},1,2,7]
[null,72,{"$f":"tlOnderdeel[[#This Row],[Onderdeel]]","v":"REGIE JONGERE"},-65,10,"REGIE JONGERE",4,2,{"$f":"B13+G13+tlOnderdeel[[#This Row],[Aantal witrijen]]","v":78},1,2,8]
[null,82,{"$f":"tlOnderdeel[[#This Row],[Onderdeel]]","v":"VAKMANSCHAP VERSTERKENDE TOOLS"},-81,-10,"VAKMANSCHAP VERSTERKENDE TOOLS",3,2,{"$f":"B14+G14+tlOnderdeel[[#This Row],[Aantal witrijen]]","v":87},1,2,9]
[null,91,{"$f":"tlOnderdeel[[#This Row],[Onderdeel]]","v":"POSITIONERING JGZ"},-56,-22,"POSITIONERING JGZ",6,2,{"$f":"B15+G15+tlOnderdeel[[#This Row],[Aantal witrijen]]","v":99},1,2,10]
[null,null,{"$f":"tblCategorie[[#Headers],[C]]","v":"C"},null,null,null,"AANPAK","ZELF / TEAM"]
[null,"Rij#","iconname","x","y","C","Aantal vragen","Aantal witrijen","Rij Totaal Score","Vragenlijst (blauw)","Vragenlijst (roze)","IDScore"]
[null,54,{"$f":"tblCategorie[[#Headers],[C]]&\" \" &tblCategorie[[#This Row],[C]]","v":"C WAT TE WETEN / METEN?"},0,-30,{"$f":"MID(INDIRECT(\"'\" &$J$5 & \"'!C\" &B18),18,100)","v":"WAT TE WETEN / METEN?"},0,0,{"$f":"B18+G18+tblCategorie[[#This Row],[Aantal witrijen]]","v":54},{"$f":"INDIRECT(\"'\" &J$5 & \"'!J\" &$I18)","v":1},{"$f":"INDIRECT(\"'\" &K$5 & \"'!J\" &$I18)","v":2},1]
[null,80,{"$f":"tblCategorie[[#Headers],[C]]&\" \" &tblCategorie[[#This Row],[C]]","v":"C JONGERE, VORM EN PROCES"},62,-16,{"$f":"MID(INDIRECT(\"'\" &$J$5 & \"'!C\" &B19),18,100)","v":"JONGERE, VORM EN PROCES"},null,null,{"$f":"B19+G19+tblCategorie[[#This Row],[Aantal witrijen]]","v":80},1,2,2,null,null,null,null,"C JONGERE, VORM EN PROCES"]
[null,89,{"$f":"tblCategorie[[#Headers],[C]]&\" \" &tblCategorie[[#This Row],[C]]","v":"C VAKMANSCHAP VERSTERKENDE TOOLS"},0,33,{"$f":"MID(INDIRECT(\"'\" &$J$5 & \"'!C\" &B20),18,100)","v":"VAKMANSCHAP VERSTERKENDE TOOLS"},null,null,{"$f":"B20+G20+tblCategorie[[#This Row],[Aantal witrijen]]","v":89},1,2,3]
{"$rows_left_out":2}
{"sheet":"SCORES","index":6,"n_rows":77,"n_cols":11,"rows_kept":77,"cut":false,"hidden":false,"merged":[]}
[]
[]
[]
[]
[]
[]
[]
[]
[]
[]
[]
[]
[]
[]
[]
[]
[]
[]
[]
[]
{"$rows_left_out":58}
{"sheet":"Informatie","index":7,"n_rows":108,"n_cols":3,"rows_kept":108,"cut":false,"hidden":false,"merged":[]}
[]
[]
[]
[]
[]
[]
[]
[null,null,"Op deze pagina vind je meer informatie over de categorieën en thema’s uit de reflectietool. We verwijzen je graag naar thema-dossiers, richtlijnen, of informatiedocumenten waar je meer informatie en inspiratie kunt vinden over de thema’s uit de tool:"]
[]
[null,null,"> WAT MOET JE WETEN/METEN ALS PROFESSIONAL"]
[]
[null,null,"ONVEILIGE OMGEVING  (BV. ONVEILIG VOELEN OP SCHOOL OF INGRIJPENDE GEBEURTENISSEN)"]
[null,null,"bv. Richtlijnen JGZ: "]
[null,null,"Kindermishandeling (2016) (ncj.nl) "]
[null,null,"Pesten (2014) (ncj.nl) "]
[null,null,"bv. Themadossiers NCJ: "]
[null,null,"Aanpak Kindermishandeling (ncj.nl)"]
[null,null,"Aanpak Armoede (ncj.nl)"]
[null,null,"Early Life Early life stress (ncj.nl)"]
[null,null,"bv. Richtlijn jeugdhulp en jeugdbescherming:"]
{"$rows_left_out":89}
{"sheet":"Wijzigingen","index":8,"n_rows":60,"n_cols":5,"rows_kept":60,"cut":false,"hidden":true,"merged":[]}
["ID",null,"Tabblad","Wijziging","Wie lost op?"]
[1,"Susan, versie 01.00","Spinnenweb","Grafiek  thema toevoegen 10 verschillende afbeeldingen (picto & tekst)","Susan"]
[2,"Susan, versie 01.00","Spinnenweb","Lijnen dikker roze & blauw","Susan"]
[3,"Susan, versie 01.00","Spinnenweb","Verticale lijn, vergelijkbaar met de schaal","Susan"]
[4,"Susan, versie 01.00","Spinnenweb","4 punten grafiek Categorie in plaats van 5 punten","Susan"]
[5,"Susan, versie 01.00","Spinnenweb","Grafiek categorie toevoegen 4 verschillende afbeeldingen (picto & tekst)","Susan"]
[6,"Telefoon dd 03.-06","Teksten","u wijzigen in je","Susan"]
[7,"Telefoon dd 03.-06","Teksten","vragenlijst teksten?","TNO"]
[8,"Telefoon dd 03.-06","Icons","sommige icons hebben een blauwe lijn -> vervangen","Remke"]
[9,"Telefoon dd 03.-06","Icons","de headers zijn niet even breed als de pagina's waardoor verhouding niet meer klopt met de roze/blauwe/gouden subheaders","Remke"]
[10,"Telefoon dd 03.-06","Ribbon","printvoorbeeld pagina toevoegen","Susan"]
[11,"Telefoon dd 03.-06","linken naar websites","een hyperlink kan alleen aan een object of een cel worden gekoppeld. Er kunnen geen links in teksten worden geplaatst, zoals in word/mailteksten","remke"]
[12,"Remke, mail dd. 04-06","Algemeen","Ik vindt de blokken combinaties boven de vragenlijsten echt veel beter nu, met die gelijke afstanden.\nZie wel dat er bij een paar buttons nog de afstanden aangepast moet worden, vooral bij de setjes buttons onderaan de pagina's. Kun je daar dezelfde afstanden maken?","Susan"]
[13,"Remke, mail dd. 04-06","Algemeen","-En de bruine blokken zijn nu overal anders, en kleiner dan de vragenlijst blokken","Susan"]
[14,"Remke, mail dd. 04-06","Algemeen","En er gebeurt iets geks: \n- veel lijkt een beetje versmald. Je ziet het het beste bij de spinnenwebben, die hebben een ei-vorm nu. Maar in de pdf is dat niet meer zo. Dat geldt ook voor de teksten in de buttons en blokken. Als ik vergelijk met mijn aangeleverde plaatjes zijn de teksten smaller, in elkaar gedrukt. Kan het dat je bij het plaatsen wat aan de verhouding lengte breedte hebt veranderd?\nIk ga het ook nog even op de laptop van Frans checken..","x"]
[15,"Remke, mail dd. 04-06","Introductie","Je hebt nu de hele link laten staan, en de regel over HEY is weg. Die moet blijven en de lange link moet weg. De link doet het wel, dat is fijn.","Susan"]
[16,"Remke, mail dd. 04-06","Introductie","-De bruine balk boven is hier nog te smal/klein","Susan"]
[17,"Remke, mail dd. 04-06","Introductie","-De roze en blauwe buttons zijn hier ook kleiner dan bij de rest, kan dat hetzelfde? (hier ook groter dus?","Susan"]
[18,"Remke, mail dd. 04-06","Vragen aanpak","-De bruine balk boven is hier nog te smal/klein-Tussen vraag 20 en 21 zit teveel wit (ook bij de roze lijst), kan dat weg?"]
[19,"Remke, mail dd. 04-06","Vragen aanpak","- Kun je de iconen nog iets strakker links/rechts precies lijnen? Grootte is mooi zo, plek tov tekst ook, alleen nog ietsje strakker plaatsen (als dat aan mijn uitsnede ligt, hoor ik het wel)"]
{"$rows_left_out":40}